{"text_format":"1","workbook":"xlsx","n_sheets":13,"sheets":["About","Definitions","Internal","All Trans","Select Tools","Manual Select","Trans Selected","Statistics","Export Tools","Price to Annual Gross","Price to SDE","Multiples Analysis","Equity Value & Minority Int"],"not_rendered":{"charts":4,"images":0,"macros":1,"external_links":0,"defined_names":110,"comments":0,"pivot_tables":0},"unopened":[{"sheet":"Price to Annual Gross","index":9,"reason":"not_a_worksheet"},{"sheet":"Price to SDE","index":10,"reason":"not_a_worksheet"}],"bounds":{"document_bytes":16777216,"sheet_cells":100000,"rows_first":2000,"rows_last":500,"rows_between":2000,"halvings":0,"cell_chars":16384,"cell_head_chars":4096},"cells_cut":0,"cells_raw":0,"read":"whole","date_system":"1900"}

{"sheet":"About","index":0,"n_rows":45,"n_cols":12,"rows_kept":45,"cut":false,"hidden":false,"merged":[[0,0,1,6],[1,11,1,14],[38,1,39,10],[3,1,6,10],[9,1,9,10],[3,11,3,14],[25,1,27,10],[34,1,35,10],[12,1,13,10],[16,1,17,10],[20,1,22,10],[30,1,31,10]]}
["ABOUT the BIZCOMPS® Analyzer™"]
[null,null,null,null,null,null,null,null,null,null,null,"Learn More About BIZCOMPS Here"]
[]
[null,"The BIZCOMPS Analyzer was created to assist BIZCOMPS subscribers in analyzing transactions from the database. The Analyzer contains a worksheet that will allow you to select and deselect transactions in Excel, which will update all the summary statistics for your comparables, create scatter graphs using your selected comparables, and will provide regression equations and valuation multiples for use in analyzing your transactions. Below is a summary of the worksheets provided in this Excel workbook.",null,null,null,null,null,null,null,null,null,"Read the BIZCOMPS® FAQ Page Here"]
[]
[]
[]
[]
[null,"Definitions"]
[null,"This worksheet provides definitions for all the fields in the BIZCOMPS database."]
{"$rows_left_out":36}
{"sheet":"Definitions","index":1,"n_rows":26,"n_cols":3,"rows_kept":26,"cut":false,"hidden":false,"merged":[[23,2,23,18],[24,2,24,18],[25,2,25,18],[0,0,1,6],[12,2,12,18],[18,2,18,18],[13,2,13,18],[22,2,22,18],[14,2,14,18],[15,2,15,18],[17,2,17,18],[21,2,21,18],[16,2,16,18],[11,2,11,18],[10,2,10,18],[20,2,20,18],[19,2,19,18],[9,2,9,18],[5,2,5,18],[4,1,4,18],[7,2,7,18],[6,2,6,18],[8,2,8,18]]}
["BIZCOMPS® Definitions"]
[]
[]
[]
[null,"Legend for BIZCOMPS® Transaction Details"]
[null,"Term","Definition"]
[null,"SIC","Standard Industrial Classification code"]
[null,"NAICS","North American Industry Classification System code"]
[null,"Business Description","Products and services of business"]
[null,"Annual Gross Sales","Annual Gross Sales ($000's), normally net of sales tax"]
{"$rows_left_out":17}
{"sheet":"Internal","index":2,"n_rows":128,"n_cols":16,"rows_kept":128,"cut":false,"hidden":true,"merged":[]}
["Transaction Selection",null,null,"Custom Criteria","Value","Min Value","Meets Min?","Max Value","Meets Max?","Meets Criteria?",null,"Available SIC:","5812",null,"Available NAICS:","722410"]
["Transaction ID",null,null,"SaleDate",{"$f":"IF(OFFSET('All Trans'!$A$1, $B$4 - 1, MATCH($D2, 'All Trans'!$1:$1, 0) - 1, 1, 1) = \"\", \"\", OFFSET('All Trans'!$A$1, $B$4 - 1, MATCH($D2, 'All Trans'!$1:$1, 0) - 1, 1, 1))","v":{"$error":"#REF!"}},null,{"$f":"IF($F2 = \"\", TRUE, IF($E2 = \"\", FALSE, $E2 >= $F2))","v":true},null,{"$f":"IF($H2 = \"\", TRUE, IF($E2 = \"\", FALSE, $E2 <= $H2))","v":true},{"$f":"AND($G2, $I2)","v":true},null,null,"5813",null,null,"722511"]
["Transaction Row (pre)",{"$f":"MATCH($B$2, 'All Trans'!$A:$A, 0)","v":{"$error":"#N/A"}},null,"SalePrice",{"$f":"IF(OFFSET('All Trans'!$A$1, $B$4 - 1, MATCH($D3, 'All Trans'!$1:$1, 0) - 1, 1, 1) = \"\", \"\", OFFSET('All Trans'!$A$1, $B$4 - 1, MATCH($D3, 'All Trans'!$1:$1, 0) - 1, 1, 1))","v":{"$error":"#REF!"}},null,true,null,true,true,null,null,null,null,null,"722513"]
["Transaction Row (post)",{"$f":"IF(ISERROR($B$3), -1, $B$3)","v":-1},null,"AnnualGross",{"$f":"IF(OFFSET('All Trans'!$A$1, $B$4 - 1, MATCH($D4, 'All Trans'!$1:$1, 0) - 1, 1, 1) = \"\", \"\", OFFSET('All Trans'!$A$1, $B$4 - 1, MATCH($D4, 'All Trans'!$1:$1, 0) - 1, 1, 1))","v":{"$error":"#REF!"}},null,true,null,true,true,null,null,null,null,null,"722515"]
["Criteria","All Transactions",null,"SDEToAnnualGross",{"$f":"IF(OFFSET('All Trans'!$A$1, $B$4 - 1, MATCH($D5, 'All Trans'!$1:$1, 0) - 1, 1, 1) = \"\", \"\", OFFSET('All Trans'!$A$1, $B$4 - 1, MATCH($D5, 'All Trans'!$1:$1, 0) - 1, 1, 1))","v":{"$error":"#REF!"}},null,true,null,true,true]
["Meets Criteria",{"$f":"OFFSET(Criteria.Options, MATCH($B$5, Criteria.Options,0) - 1, 1, 1, 1)","v":false},null,"RentToAnnualGross",{"$f":"IF(OFFSET('All Trans'!$A$1, $B$4 - 1, MATCH($D6, 'All Trans'!$1:$1, 0) - 1, 1, 1) = \"\", \"\", OFFSET('All Trans'!$A$1, $B$4 - 1, MATCH($D6, 'All Trans'!$1:$1, 0) - 1, 1, 1))","v":{"$error":"#REF!"}},null,true,null,true,true]
[null,null,null,"SDE",{"$f":"IF(OFFSET('All Trans'!$A$1, $B$4 - 1, MATCH($D7, 'All Trans'!$1:$1, 0) - 1, 1, 1) = \"\", \"\", OFFSET('All Trans'!$A$1, $B$4 - 1, MATCH($D7, 'All Trans'!$1:$1, 0) - 1, 1, 1))","v":{"$error":"#REF!"}},null,true,null,true,true]
["Criteria Options","Meets Criteria?",null,"InventoryAmount",{"$f":"IF(OFFSET('All Trans'!$A$1, $B$4 - 1, MATCH($D8, 'All Trans'!$1:$1, 0) - 1, 1, 1) = \"\", \"\", OFFSET('All Trans'!$A$1, $B$4 - 1, MATCH($D8, 'All Trans'!$1:$1, 0) - 1, 1, 1))","v":{"$error":"#REF!"}},null,true,null,true,true]
["All Transactions",{"$f":"$B$4 > 0","v":false},null,"FFE",{"$f":"IF(OFFSET('All Trans'!$A$1, $B$4 - 1, MATCH($D9, 'All Trans'!$1:$1, 0) - 1, 1, 1) = \"\", \"\", OFFSET('All Trans'!$A$1, $B$4 - 1, MATCH($D9, 'All Trans'!$1:$1, 0) - 1, 1, 1))","v":{"$error":"#REF!"}},null,true,null,true,true]
["Custom Criteria",{"$f":"IF(ISERROR(AND($J$2:$J$13)), FALSE, AND($J$2:$J$13) )","v":true}]
{"$rows_left_out":119}
{"sheet":"All Trans","index":3,"n_rows":136,"n_cols":24,"rows_kept":136,"cut":false,"hidden":false,"merged":[]}
["TransactionID","SICCode","SICCodeGeneral","NAICSGeneral","NAICSCode","BusinessDescription","Area","Country","AnnualGross","SaleDate","SDE","SalePrice","AskPrice","SDEtoAnnualGross","SalePriceToAnnualGross","SalePriceToSDE","PercentDown","Terms","InventoryAmount","FFE","RentToAnnualGross","DaysOnMarket","FranchiseRoyalty","NumberOfEmployees"]
[11351,{"$f":"TEXT(\"5812\",\"0000\")","v":"5812"},{"$f":"TEXT(\"58\",\"00\")","v":"58"},{"$f":"TEXT(\"722\",\"000\")","v":"722"},722513,"Fast Food-Burgers","Southeast","United States",2550,"2014-03-31",315,1300,1300,0.124,0.51,4.1269999999999998,null,null,13,null,null,null,"No"]
[10989,"5812","58","722",722513,"Fast Food-Burgers","South Atlantic","United States",2500,"2014-02-28",505,2200,2400,0.20200000000000001,0.88,4.3559999999999999,null,null,15,null,null,null,"No"]
[4033,"5812","58","722",722511,"Restr-Family","Florida","United States",2235,"2014-04-14",342,650,975,0.153,0.29099999999999998,1.901,1,null,0,50,null,120,"No",7]
[5394,"5812","58","722",722511,"Restr-Ethnic","Florida","United States",2190,"2014-05-05",413,492,642,0.189,0.22500000000000001,1.1910000000000001,0.2,"1 Yr @ 4%",8,89,null,65,"Y-5%",15]
[11659,"5812","58","722",722511,"Restr W/Cocktails","Texas","United States",1702,"2014-07-14",143,388,783,8.4000000000000005E-2,0.22800000000000001,2.7130000000000001,0.3,null,0,15,null,null,"No"]
[1059,"5812","58","722",722513,"Bakery-Restaurant","Colorado","United States",1588,"2014-02-28",247,500,500,0.156,0.315,2.024,0.48,null,25,100,null,150,"No",2]
[10765,"5812","58","722",722511,"Restr-Family","San Jose, CA","United States",1543,"2014-04-28",180,250,395,0.11700000000000001,0.16200000000000001,1.389,null,null,0,null,null,null,"No"]
[7403,"5812","58","722",722511,"Restr W/Cocktails","Houston, TX","United States",1527,"2014-12-05",356,700,750,0.23300000000000001,0.45800000000000002,1.966,null,null,0,359,null,null,"No","2 FT/10 PT"]
[8932,"5812","58","722",722511,"Restr-Family","New England","United States",1411,"2014-05-19",258,325,775,0.183,0.23,1.26,0.16,"20 Yrs @ 2%",11,259,null,36,"No","5 FT/3 PT"]
{"$rows_left_out":127}
{"sheet":"Select Tools","index":4,"n_rows":26,"n_cols":12,"rows_kept":26,"cut":false,"hidden":false,"merged":[[1,8,1,12],[1,1,1,6],[2,1,2,6]]}
[]
[null,"Selection Criteria",null,null,null,null,null,null,"Total Population from \"All Trans\" Sheet"]
[null,"Selects transactions that meet the following criteria. Blank fields are ignored.",null,null,null,null,null,null,null,null,"Count =",{"$f":"Statistics!C19","v":135}]
[]
[null,null,null,null,"Min","Max",null,null,null,null,"Min","Max"]
[null,null,"Sale Date",null,null,null,null,null,null,"Sale Date",{"$f":"Statistics!D19","v":"2014-01-02"},{"$f":"Statistics!E19","v":"2014-12-31"}]
[null,null,"Sale Price",null,null,null,null,null,null,"Sale Price",{"$f":"Statistics!D24","v":25},{"$f":"Statistics!E24","v":2200}]
[null,null,"Annual Gross Sales",null,null,null,null,null,null,"Annual Gross Sales",{"$f":"Statistics!D20","v":73},{"$f":"Statistics!E20","v":2550}]
[null,null,"SDE to Annual Gross",null,null,null,null,null,null,"SDE to Annual Gross",{"$f":"Statistics!D25","v":-3.9E-2},{"$f":"Statistics!E25","v":0.6}]
[null,null,"Rent to Annual Gross",null,null,null,null,null,null,"Rent to Annual Gross",{"$f":"Statistics!D26","v":8.9999999999999993E-3},{"$f":"Statistics!E26","v":13}]
{"$rows_left_out":17}
{"sheet":"Manual Select","index":5,"n_rows":136,"n_cols":25,"rows_kept":136,"cut":false,"hidden":false,"merged":[]}
["Select","TransactionID","SICCode","SICCodeGeneral","NAICSGeneral","NAICSCode","BusinessDescription","Area","Country","AnnualGross","SaleDate","SDE","SalePrice","AskPrice","SDEtoAnnualGross","SalePriceToAnnualGross","SalePriceToSDE","PercentDown","Terms","InventoryAmount","FFE","RentToAnnualGross","DaysOnMarket","FranchiseRoyalty","NumberOfEmployees"]
["Yes",11351,{"$f":"TEXT(\"5812\",\"0000\")","v":"5812"},{"$f":"TEXT(\"58\",\"00\")","v":"58"},{"$f":"TEXT(\"722\",\"000\")","v":"722"},722513,"Fast Food-Burgers","Southeast","United States",2550,"2014-03-31",315,1300,1300,0.124,0.51,4.1269999999999998,null,null,13,null,null,null,"No"]
["Yes",10989,"5812","58","722",722513,"Fast Food-Burgers","South Atlantic","United States",2500,"2014-02-28",505,2200,2400,0.20200000000000001,0.88,4.3559999999999999,null,null,15,null,null,null,"No"]
["Yes",4033,"5812","58","722",722511,"Restr-Family","Florida","United States",2235,"2014-04-14",342,650,975,0.153,0.29099999999999998,1.901,1,null,0,50,null,120,"No",7]
["Yes",5394,"5812","58","722",722511,"Restr-Ethnic","Florida","United States",2190,"2014-05-05",413,492,642,0.189,0.22500000000000001,1.1910000000000001,0.2,"1 Yr @ 4%",8,89,null,65,"Y-5%",15]
["Yes",11659,"5812","58","722",722511,"Restr W/Cocktails","Texas","United States",1702,"2014-07-14",143,388,783,8.4000000000000005E-2,0.22800000000000001,2.7130000000000001,0.3,null,0,15,null,null,"No"]
["Yes",1059,"5812","58","722",722513,"Bakery-Restaurant","Colorado","United States",1588,"2014-02-28",247,500,500,0.156,0.315,2.024,0.48,null,25,100,null,150,"No",2]
["Yes",10765,"5812","58","722",722511,"Restr-Family","San Jose, CA","United States",1543,"2014-04-28",180,250,395,0.11700000000000001,0.16200000000000001,1.389,null,null,0,null,null,null,"No"]
["Yes",7403,"5812","58","722",722511,"Restr W/Cocktails","Houston, TX","United States",1527,"2014-12-05",356,700,750,0.23300000000000001,0.45800000000000002,1.966,null,null,0,359,null,null,"No","2 FT/10 PT"]
["Yes",8932,"5812","58","722",722511,"Restr-Family","New England","United States",1411,"2014-05-19",258,325,775,0.183,0.23,1.26,0.16,"20 Yrs @ 2%",11,259,null,36,"No","5 FT/3 PT"]
{"$rows_left_out":127}
{"sheet":"Trans Selected","index":6,"n_rows":136,"n_cols":24,"rows_kept":136,"cut":false,"hidden":false,"merged":[]}
["TransactionID","SICCode","SICCodeGeneral","NAICSGeneral","NAICSCode","BusinessDescription","Area","Country","AnnualGross","SaleDate","SDE","SalePrice","AskPrice","SDEtoAnnualGross","SalePriceToAnnualGross","SalePriceToSDE","PercentDown","Terms","InventoryAmount","FFE","RentToAnnualGross","DaysOnMarket","FranchiseRoyalty","NumberOfEmployees"]
[11351,{"$f":"TEXT(\"5812\",\"0000\")","v":"5812"},{"$f":"TEXT(\"58\",\"00\")","v":"58"},{"$f":"TEXT(\"722\",\"000\")","v":"722"},722513,"Fast Food-Burgers","Southeast","United States",2550,"2014-03-31",315,1300,1300,0.124,0.51,4.1269999999999998,null,null,13,null,null,null,"No"]
[10989,"5812","58","722",722513,"Fast Food-Burgers","South Atlantic","United States",2500,"2014-02-28",505,2200,2400,0.20200000000000001,0.88,4.3559999999999999,null,null,15,null,null,null,"No"]
[4033,"5812","58","722",722511,"Restr-Family","Florida","United States",2235,"2014-04-14",342,650,975,0.153,0.29099999999999998,1.901,1,null,0,50,null,120,"No",7]
[5394,"5812","58","722",722511,"Restr-Ethnic","Florida","United States",2190,"2014-05-05",413,492,642,0.189,0.22500000000000001,1.1910000000000001,0.2,"1 Yr @ 4%",8,89,null,65,"Y-5%",15]
[11659,"5812","58","722",722511,"Restr W/Cocktails","Texas","United States",1702,"2014-07-14",143,388,783,8.4000000000000005E-2,0.22800000000000001,2.7130000000000001,0.3,null,0,15,null,null,"No"]
[1059,"5812","58","722",722513,"Bakery-Restaurant","Colorado","United States",1588,"2014-02-28",247,500,500,0.156,0.315,2.024,0.48,null,25,100,null,150,"No",2]
[10765,"5812","58","722",722511,"Restr-Family","San Jose, CA","United States",1543,"2014-04-28",180,250,395,0.11700000000000001,0.16200000000000001,1.389,null,null,0,null,null,null,"No"]
[7403,"5812","58","722",722511,"Restr W/Cocktails","Houston, TX","United States",1527,"2014-12-05",356,700,750,0.23300000000000001,0.45800000000000002,1.966,null,null,0,359,null,null,"No","2 FT/10 PT"]
[8932,"5812","58","722",722511,"Restr-Family","New England","United States",1411,"2014-05-19",258,325,775,0.183,0.23,1.26,0.16,"20 Yrs @ 2%",11,259,null,36,"No","5 FT/3 PT"]
{"$rows_left_out":127}
{"sheet":"Statistics","index":7,"n_rows":30,"n_cols":13,"rows_kept":30,"cut":false,"hidden":false,"merged":[[1,1,1,12],[15,1,15,12]]}
[]
[null,"Selected Transactions"]
[]
[null,null,"Count ","Min","Max","10th Percentile","25th Percentile","Median ","75th Percentile","90th Percentile","Mean ","Harmonic Mean","Coefficient of Variation"]
[null,"Sale Date",{"$f":"COUNT(Selected.SaleDate)","v":135},{"$f":"IF(C5>0,MIN(Selected.SaleDate),\"N/A\")","v":"2014-01-02"},{"$f":"IF(C5>0,MAX(Selected.SaleDate),\"N/A\")","v":"2014-12-31"}]
[null,"Annual Gross Sales",{"$f":"COUNT(Selected.AnnualGross)","v":135},{"$f":"IF(C6>0,MIN(Selected.AnnualGross),\"N/A\")","v":73},{"$f":"IF(C6>0,MAX(Selected.AnnualGross),\"N/A\")","v":2550},{"$f":"IF(C6>8,PERCENTILE(Selected.AnnualGross,0.1),\"N/A\")","v":181},{"$f":"IF(C6>2,PERCENTILE(Selected.AnnualGross,0.25),\"N/A\")","v":254.5},{"$f":"IF(C6>1,MEDIAN(Selected.AnnualGross),\"N/A\")","v":421},{"$f":"IF(C6>2,PERCENTILE(Selected.AnnualGross,0.75),\"N/A\")","v":720},{"$f":"IF(C6>8,PERCENTILE(Selected.AnnualGross,0.9),\"N/A\")","v":1134},{"$f":"IF(C6>1,AVERAGE(Selected.AnnualGross),\"N/A\")","v":586.88888888888891}]
[null,"SDE",{"$f":"COUNT(Selected.SDE)","v":131},{"$f":"IF(C7>0,MIN(Selected.SDE),\"N/A\")","v":-10},{"$f":"IF(C7>0,MAX(Selected.SDE),\"N/A\")","v":591},{"$f":"IF(C7>8,PERCENTILE(Selected.SDE,0.1),\"N/A\")","v":25},{"$f":"IF(C7>2,PERCENTILE(Selected.SDE,0.25),\"N/A\")","v":44},{"$f":"IF(C7>1,MEDIAN(Selected.SDE),\"N/A\")","v":73},{"$f":"IF(C7>2,PERCENTILE(Selected.SDE,0.75),\"N/A\")","v":135.5},{"$f":"IF(C7>8,PERCENTILE(Selected.SDE,0.9),\"N/A\")","v":229},{"$f":"IF(C7>1,AVERAGE(Selected.SDE),\"N/A\")","v":104}]
[null,"Inventory Value",{"$f":"COUNT(Selected.InventoryAmount)","v":135},{"$f":"IF(C8>0,MIN(Selected.InventoryAmount),\"N/A\")","v":0},{"$f":"IF(C8>0,MAX(Selected.InventoryAmount),\"N/A\")","v":61},{"$f":"IF(C8>8,PERCENTILE(Selected.InventoryAmount,0.1),\"N/A\")","v":0},{"$f":"IF(C8>2,PERCENTILE(Selected.InventoryAmount,0.25),\"N/A\")","v":0},{"$f":"IF(C8>1,MEDIAN(Selected.InventoryAmount),\"N/A\")","v":2},{"$f":"IF(C8>2,PERCENTILE(Selected.InventoryAmount,0.75),\"N/A\")","v":5},{"$f":"IF(C8>8,PERCENTILE(Selected.InventoryAmount,0.9),\"N/A\")","v":8.6000000000000085},{"$f":"IF(C8>1,AVERAGE(Selected.InventoryAmount),\"N/A\")","v":3.6962962962962962}]
[null,"FF&E",{"$f":"COUNT(Selected.FFE)","v":87},{"$f":"IF(C9>0,MIN(Selected.FFE),\"N/A\")","v":3},{"$f":"IF(C9>0,MAX(Selected.FFE),\"N/A\")","v":385},{"$f":"IF(C9>8,PERCENTILE(Selected.FFE,0.1),\"N/A\")","v":20.6},{"$f":"IF(C9>2,PERCENTILE(Selected.FFE,0.25),\"N/A\")","v":30},{"$f":"IF(C9>1,MEDIAN(Selected.FFE),\"N/A\")","v":50},{"$f":"IF(C9>2,PERCENTILE(Selected.FFE,0.75),\"N/A\")","v":72.5},{"$f":"IF(C9>8,PERCENTILE(Selected.FFE,0.9),\"N/A\")","v":132.00000000000003},{"$f":"IF(C9>1,AVERAGE(Selected.FFE),\"N/A\")","v":67.988505747126439}]
[null,"Sale Price (Excludes Inventory)",{"$f":"COUNT(Selected.SalePrice)","v":135},{"$f":"IF(C10>0,MIN(Selected.SalePrice),\"N/A\")","v":25},{"$f":"IF(C10>0,MAX(Selected.SalePrice),\"N/A\")","v":2200},{"$f":"IF(C10>8,PERCENTILE(Selected.SalePrice,0.1),\"N/A\")","v":50},{"$f":"IF(C10>2,PERCENTILE(Selected.SalePrice,0.25),\"N/A\")","v":70.5},{"$f":"IF(C10>1,MEDIAN(Selected.SalePrice),\"N/A\")","v":124},{"$f":"IF(C10>2,PERCENTILE(Selected.SalePrice,0.75),\"N/A\")","v":223.5},{"$f":"IF(C10>8,PERCENTILE(Selected.SalePrice,0.9),\"N/A\")","v":450},{"$f":"IF(C10>1,AVERAGE(Selected.SalePrice),\"N/A\")","v":207.86666666666667}]
{"$rows_left_out":21}
{"sheet":"Export Tools","index":8,"n_rows":17,"n_cols":6,"rows_kept":17,"cut":false,"hidden":false,"merged":[[12,1,12,6],[13,1,13,6],[1,1,1,6],[2,1,2,6]]}
[]
[null,"Export Worksheets"]
[null,"Select the optional worksheets to export."]
[]
[null,null,"About",null,null,"Yes"]
[null,null,"Definitions",null,null,"Yes"]
[null,null,"All Trans",null,null,"Yes"]
[null,null,"Statistics",null,null,"Yes"]
[null,null,"Multiples Analysis",null,null,"Yes"]
[null,null,"Equity Value & Minority Int",null,null,"Yes"]
{"$rows_left_out":8}
{"sheet":"Multiples Analysis","index":11,"n_rows":38,"n_cols":26,"rows_kept":38,"cut":false,"hidden":false,"merged":[[15,25,16,25],[15,21,16,21],[15,18,16,19],[18,18,18,19],[19,18,19,19],[18,15,18,16],[19,15,19,16],[15,15,16,16],[18,7,18,8],[15,10,16,13],[18,10,18,13],[19,7,19,8],[15,7,16,8],[13,0,13,3],[15,5,16,5],[18,1,18,3],[19,1,19,3],[15,1,16,3],[0,0,1,11],[3,1,3,5],[6,1,6,3],[5,1,5,3],[3,8,12,23],[27,0,27,3],[29,1,30,3],[29,5,30,5],[29,7,30,8],[29,10,30,13],[33,1,33,3],[33,7,33,8],[33,15,33,16],[29,15,30,16],[32,1,32,3],[32,7,32,8],[32,10,32,13],[32,15,32,16],[35,17,35,19],[29,21,30,21],[29,23,30,23],[29,18,30,19],[32,18,32,19],[33,18,33,19]]}
["BIZCOMPS® Multiples Analysis"]
[]
[]
[null,"Subject Company Information",null,null,null,null,null,null,"The Analyzer contains two methods of calculating a value using the Weighted Multiples Application section or the Contribution Multiples Application section – with one section using weights, the other using percentages.  The user can use one or the other or both in their analysis. On this sheet, the grey cells are input cells (cells that accept inputs from you).\n\nINSTRUCTIONS: Enter your subject company information in the \"Subject Company Information\" section. Leave any fields blank that you do not wish to use. Do not enter any financial information that is negative (if you do, it will not be considered). Enter dollar figures in whole numbers. Enter currency figures in thousands (example: for $1 million, you would enter $1,000). Next, select which type of valuation multiples you want to use from the “Select Statistical Measure to Use” section. In the \"Weighted Multiples Application\" section, select your desired weights (the higher the number selected, the greater the weight given). Select \"N/A\" if you do not wish to use that valuation multiple. In the \"Contribution Multiples Application\" section, select your desired percentage to allocate towards the indicated value. Select \"0%\" if you do not wish to use that value."]
[]
[null,"Annual Gross Sales ($000s)"]
[null,"SDE ($000s)"]
[]
[]
[]
{"$rows_left_out":29}
{"sheet":"Equity Value & Minority Int","index":12,"n_rows":49,"n_cols":17,"rows_kept":49,"cut":false,"hidden":false,"merged":[[0,0,1,10],[14,12,14,16],[3,1,17,10],[48,12,50,22],[27,1,28,5],[31,1,32,5],[2,12,3,16],[21,1,22,7],[25,1,26,4],[0,12,1,19]]}
["Equity Value and Minority Interest Analysis",null,null,null,null,null,null,null,null,null,null,null,"Note: The sale price in BIZCOMPS does not include the value of inventory acquired. Currency fields are in thousands (example: $1 million would be displayed as $1,000)."]
[]
[null,null,null,null,null,null,null,null,null,null,null,null,"Typical application of Asset Multiples"]
[null,"BIZCOMPS® multiples yield Market Value of Invested Capital (MVIC) values. Many appraisers, ultimately, are attempting to get to an equity value for their subject company. Doing so requires adding back some assets and subtracting some liabilities. The typical treatment of the MVIC price is outlined to the right and is based on The Comprehensive Guide to the Use and Application of the Transaction Databases, by Nancy J. Fannon and Heidi P. Walker. Further, BIZCOMPS® data is comprised of 100% private business sales, and some appraisers seek to value a minority interest. As a result, some appraisers valuing a minority interest may wish to apply a discount for lack of marketability and/or a discount for lack of control to a pro rate value resulting from the application of the BIZCOMPS® valuation multiples. This section gives you the opportunity to do that, if you wish. Also, if you need to modify any sale prices or valuation multiples (to add or remove any assets or liabilities), remember you can do so on the \"All Trans\" worksheet–changes on that worksheet will flow through the rest of this workbook.\n\nOn the right is a tool to help you in reaching a 100% equity value or a less than 100% equity value. Depending on your analysis, various fields may not be relevant to you. All grey cells are input cells You may choose to enter $0 into an input cell or if the cell is the dropdown menu, you may select \"N/A\". Enter all numeric values as a positive number. Your values from the \"Multiples Analysis\" worksheet have been brought over."]
[null,null,null,null,null,null,null,null,null,null,null,null," Subject Company Revenue or Earnings \n"]
[null,null,null,null,null,null,null,null,null,null,null,null," X Pricing Multiple (as selected by appraiser)"]
[null,null,null,null,null,null,null,null,null,null,null,null," =  Indicated Market Value of Invested Capital"]
[null,null,null,null,null,null,null,null,null,null,null,null," + Assets not included in the multiple (usually AR and cash)"]
[null,null,null,null,null,null,null,null,null,null,null,null," - Liabilities excluded from the multiple (usually all)"]
[null,null,null,null,null,null,null,null,null,null,null,null," + Real estate "]
{"$rows_left_out":39}